|
Subject: Persistent iOS Build Failure: darwin-podhelper.rb Circular Dependency on Standard Flutter Build
|
|
1
|
131
|
June 4, 2025
|
|
Xcode Build for Simulator Succeeds But Build Is Just Black Screen
|
|
0
|
52
|
June 3, 2025
|
|
"Test Reports wasn't configured correctly." with Junit XML file
|
|
0
|
79
|
June 3, 2025
|
|
WhiteListing Build IP's
|
|
0
|
42
|
May 7, 2025
|
|
Android Emulator - None of the images <API34 are working
|
|
3
|
263
|
May 5, 2025
|
|
Failed to Trigger the Build: cannot unmarshal number into Go struct field
|
|
2
|
81
|
April 25, 2025
|
|
Commit message trigger firing on commit_messages
|
|
0
|
76
|
April 23, 2025
|
|
How to get the trigger type from within a build
|
|
0
|
33
|
April 11, 2025
|
|
[CodeSigning] Can't upload iOS signing certificates: I get a 400 error from POST https://app.bitrise.io/build_certificate/preview
|
|
3
|
151
|
April 9, 2025
|
|
React Native - ios extensions
|
|
1
|
100
|
April 8, 2025
|
|
Fetching a swift package using .netrc
|
|
0
|
155
|
April 2, 2025
|
|
Bitrise-step-install-bundle fails to load
|
|
2
|
103
|
April 2, 2025
|
|
Xcode build command not applied
|
|
0
|
146
|
March 21, 2025
|
|
ARCHIVE FAILED PhaseScriptExecution Bundle\ React\ Native\ code\ and\ images
|
|
0
|
96
|
March 19, 2025
|
|
Merge build, fatal: ambiguous argument 'HEAD^': unknown revision or path not in the working tree
|
|
1
|
188
|
March 14, 2025
|
|
Bitrise Doashboard error status 500
|
|
2
|
61
|
March 13, 2025
|
|
Cannot authenticate with Apple ID connection
|
|
1
|
142
|
March 11, 2025
|
|
GH Status report is missung with Pipeline triggered with bitrise API
|
|
0
|
24
|
March 7, 2025
|
|
Upgrading xcode stack to 16.2 fails
|
|
1
|
258
|
March 6, 2025
|
|
Xcode 16.2 performance issues while running tests
|
|
1
|
270
|
March 6, 2025
|
|
Xcode build fails with "Build fails Packages are not supported when using legacy build locations..."
|
|
1
|
204
|
March 6, 2025
|
|
Fastlane Match Decryption Failed - Invalid MATCH_PASSWORD Error on Bitrise
|
|
0
|
379
|
February 26, 2025
|
|
Only run step if if changed files contains tests
|
|
0
|
101
|
February 14, 2025
|
|
Unit Tests with Mockk always fails on CI but works on locally
|
|
1
|
84
|
February 13, 2025
|
|
AssetDataSourceException: java.io.FileNotFoundException: splash_video.mp4
|
|
1
|
80
|
February 10, 2025
|
|
Type hint for inputs in step.yml
|
|
0
|
28
|
January 29, 2025
|
|
Is there a way to see the .xcresult file in the Artifacts tab for actual device testing?
|
|
0
|
51
|
January 28, 2025
|
|
Bitrise `save-spm-cache` step takes a lot of time
|
|
1
|
139
|
January 21, 2025
|
|
beforeAll() timesout when running e2e on bitrise (not happening on local)
|
|
0
|
27
|
January 20, 2025
|
|
How to set the baseline metrics in UI tests and compare the results with the metrics values in bitrise
|
|
0
|
45
|
January 17, 2025
|