Cannot run appium tests in Bitrise (java+selenide+ios)

I am trying to run automation tests in Bitrise but got an error. I can run my tests on my local machine and everything is ok.

device: simulator iOS 15.4
machine: Xcode 13.3.x on macOS 12.2
java: 17
selenide 6.4.0
appium 1.22.3
gradle 7.4
Node.js: 12.22.11
NPM: 6.14.16
Could you please help me?

2022-04-18T15:44:01.571+0000 [DEBUG] [TestEventLogger]     [debug] [WD Proxy] Matched '/status' to command name 'getStatus'
2022-04-18T15:44:01.571+0000 [DEBUG] [TestEventLogger]     [debug] [WD Proxy] Proxying [GET /status] to [GET http://127.0.0.1:8237/status] with no body
2022-04-18T15:44:01.572+0000 [DEBUG] [TestEventLogger]     [WD Proxy] connect ECONNREFUSED 127.0.0.1:8237
2022-04-18T15:44:02.335+0000 [DEBUG] [TestEventLogger] 
2022-04-18T15:44:02.335+0000 [DEBUG] [TestEventLogger] com.tunein.mobile.tests.ios.IosBooksAroundFirstTest.beforeTest STARTED
2022-04-18T15:44:02.390+0000 [DEBUG] [TestEventLogger] 
2022-04-18T15:44:02.390+0000 [DEBUG] [TestEventLogger] com.tunein.mobile.tests.ios.IosBooksAroundFirstTest.beforeTest FAILED
2022-04-18T15:44:02.391+0000 [DEBUG] [TestEventLogger]     org.openqa.selenium.SessionNotCreatedException: Could not start a new session. Possible causes are invalid address of the remote server or browser start-up failure.
2022-04-18T15:44:02.391+0000 [DEBUG] [TestEventLogger]         at app//org.openqa.selenium.remote.RemoteWebDriver.execute(RemoteWebDriver.java:585)
2022-04-18T15:44:02.391+0000 [DEBUG] [TestEventLogger]         at app//io.appium.java_client.AppiumDriver.startSession(AppiumDriver.java:225)
2022-04-18T15:44:02.391+0000 [DEBUG] [TestEventLogger]         at app//org.openqa.selenium.remote.RemoteWebDriver.<init>(RemoteWebDriver.java:164)
2022-04-18T15:44:02.391+0000 [DEBUG] [TestEventLogger]         at app//io.appium.java_client.AppiumDriver.<init>(AppiumDriver.java:79)
2022-04-18T15:44:02.391+0000 [DEBUG] [TestEventLogger]         at app//io.appium.java_client.AppiumDriver.<init>(AppiumDriver.java:87)
2022-04-18T15:44:02.391+0000 [DEBUG] [TestEventLogger]         at app//io.appium.java_client.ios.IOSDriver.<init>(IOSDriver.java:105)
2022-04-18T15:44:02.391+0000 [DEBUG] [TestEventLogger]         at app//com.tunein.mobile.appium.driverprovider.IosDriverProvider.createDriver(IosDriverProvider.java:73)
2022-04-18T15:44:02.391+0000 [DEBUG] [TestEventLogger]         at app//com.codeborne.selenide.webdriver.DefaultDriverFactory.createInstanceOf(DefaultDriverFactory.java:40)
2022-04-18T15:44:02.391+0000 [DEBUG] [TestEventLogger]         at app//com.codeborne.selenide.webdriver.DefaultDriverFactory.create(DefaultDriverFactory.java:29)
2022-04-18T15:44:02.391+0000 [DEBUG] [TestEventLogger]         at app//com.codeborne.selenide.webdriver.WebDriverFactory.createWebDriverInstance(WebDriverFactory.java:109)
2022-04-18T15:44:02.391+0000 [DEBUG] [TestEventLogger]         at app//com.codeborne.selenide.webdriver.WebDriverFactory.createWebDriver(WebDriverFactory.java:69)
2022-04-18T15:44:02.391+0000 [DEBUG] [TestEventLogger]         at app//com.codeborne.selenide.drivercommands.CreateDriverCommand.lambda$createDriver$1(CreateDriverCommand.java:80)
2022-04-18T15:44:02.391+0000 [DEBUG] [TestEventLogger]         at app//com.codeborne.selenide.logevents.SelenideLogger.get(SelenideLogger.java:165)
2022-04-18T15:44:02.391+0000 [DEBUG] [TestEventLogger]         at app//com.codeborne.selenide.drivercommands.CreateDriverCommand.createDriver(CreateDriverCommand.java:53)
2022-04-18T15:44:02.391+0000 [DEBUG] [TestEventLogger]         at app//com.codeborne.selenide.impl.WebDriverThreadLocalContainer.createDriver(WebDriverThreadLocalContainer.java:170)
2022-04-18T15:44:02.391+0000 [DEBUG] [TestEventLogger]         at app//com.codeborne.selenide.impl.WebDriverThreadLocalContainer.getAndCheckWebDriver(WebDriverThreadLocalContainer.java:156)
2022-04-18T15:44:02.391+0000 [DEBUG] [TestEventLogger]         at app//com.codeborne.selenide.WebDriverRunner.getAndCheckWebDriver(WebDriverRunner.java:130)
2022-04-18T15:44:02.391+0000 [DEBUG] [TestEventLogger]         at app//com.codeborne.selenide.impl.StaticDriver.getAndCheckWebDriver(StaticDriver.java:65)
2022-04-18T15:44:02.392+0000 [DEBUG] [TestEventLogger]         at app//com.codeborne.selenide.SelenideDriver.getAndCheckWebDriver(SelenideDriver.java:206)
2022-04-18T15:44:02.392+0000 [DEBUG] [TestEventLogger]         at app//com.codeborne.selenide.logevents.SelenideLogger.run(SelenideLogger.java:152)
2022-04-18T15:44:02.392+0000 [DEBUG] [TestEventLogger]         at app//com.codeborne.selenide.drivercommands.Navigator.open(Navigator.java:86)
2022-04-18T15:44:02.392+0000 [DEBUG] [TestEventLogger]         at app//com.codeborne.selenide.SelenideDriver.open(SelenideDriver.java:97)
2022-04-18T15:44:02.392+0000 [DEBUG] [TestEventLogger]         at app//com.codeborne.selenide.Selenide.open(Selenide.java:127)
2022-04-18T15:44:02.392+0000 [DEBUG] [TestEventLogger]         at app//com.tunein.mobile.appium.driverprovider.AppiumDriverProvider.getAppiumDriver(AppiumDriverProvider.java:17)
2022-04-18T15:44:02.392+0000 [DEBUG] [TestEventLogger]         at app//com.tunein.mobile.tests.BaseTest.beforeTest(BaseTest.java:47)
2022-04-18T15:44:02.392+0000 [DEBUG] [TestEventLogger]         at java.base@17.0.2/jdk.internal.reflect.NativeMethodAccessorImpl.invoke0(Native Method)
2022-04-18T15:44:02.392+0000 [DEBUG] [TestEventLogger]         at java.base@17.0.2/jdk.internal.reflect.NativeMethodAccessorImpl.invoke(NativeMethodAccessorImpl.java:77)
2022-04-18T15:44:02.392+0000 [DEBUG] [TestEventLogger]         at java.base@17.0.2/jdk.internal.reflect.DelegatingMethodAccessorImpl.invoke(DelegatingMethodAccessorImpl.java:43)
2022-04-18T15:44:02.392+0000 [DEBUG] [TestEventLogger]         at java.base@17.0.2/java.lang.reflect.Method.invoke(Method.java:568)
2022-04-18T15:44:02.392+0000 [DEBUG] [TestEventLogger]         at app//org.testng.internal.invokers.MethodInvocationHelper.invokeMethod(MethodInvocationHelper.java:135)
2022-04-18T15:44:02.392+0000 [DEBUG] [TestEventLogger]         at app//org.testng.internal.invokers.MethodInvocationHelper.invokeMethodConsideringTimeout(MethodInvocationHelper.java:65)
2022-04-18T15:44:02.392+0000 [DEBUG] [TestEventLogger]         at app//org.testng.internal.invokers.ConfigInvoker.invokeConfigurationMethod(ConfigInvoker.java:381)
2022-04-18T15:44:02.392+0000 [DEBUG] [TestEventLogger]         at app//org.testng.internal.invokers.ConfigInvoker.invokeConfigurations(ConfigInvoker.java:319)
2022-04-18T15:44:02.392+0000 [DEBUG] [TestEventLogger]         at app//org.testng.TestRunner.invokeTestConfigurations(TestRunner.java:645)
2022-04-18T15:44:02.392+0000 [DEBUG] [TestEventLogger]         at app//org.testng.TestRunner.beforeRun(TestRunner.java:634)
2022-04-18T15:44:02.392+0000 [DEBUG] [TestEventLogger]         at app//org.testng.TestRunner.run(TestRunner.java:596)
2022-04-18T15:44:02.392+0000 [DEBUG] [TestEventLogger]         at app//org.testng.SuiteRunner.runTest(SuiteRunner.java:429)
2022-04-18T15:44:02.393+0000 [DEBUG] [TestEventLogger]         at app//org.testng.SuiteRunner.access$000(SuiteRunner.java:32)
2022-04-18T15:44:02.393+0000 [DEBUG] [TestEventLogger]         at app//org.testng.SuiteRunner$SuiteWorker.run(SuiteRunner.java:467)
2022-04-18T15:44:02.393+0000 [DEBUG] [TestEventLogger]         at app//org.testng.internal.thread.ThreadUtil.lambda$execute$0(ThreadUtil.java:58)
2022-04-18T15:44:02.393+0000 [DEBUG] [TestEventLogger]         at java.base@17.0.2/java.util.concurrent.FutureTask.run(FutureTask.java:264)
2022-04-18T15:44:02.393+0000 [DEBUG] [TestEventLogger]         at java.base@17.0.2/java.util.concurrent.ThreadPoolExecutor.runWorker(ThreadPoolExecutor.java:1136)
2022-04-18T15:44:02.393+0000 [DEBUG] [TestEventLogger]         at java.base@17.0.2/java.util.concurrent.ThreadPoolExecutor$Worker.run(ThreadPoolExecutor.java:635)
2022-04-18T15:44:02.393+0000 [DEBUG] [TestEventLogger]         at java.base@17.0.2/java.lang.Thread.run(Thread.java:833)
2022-04-18T15:44:02.393+0000 [DEBUG] [TestEventLogger] 
2022-04-18T15:44:02.393+0000 [DEBUG] [TestEventLogger]         Caused by:
2022-04-18T15:44:02.393+0000 [DEBUG] [TestEventLogger]         org.openqa.selenium.WebDriverException: java.lang.reflect.InvocationTargetException
2022-04-18T15:44:02.393+0000 [DEBUG] [TestEventLogger]         Build info: version: '4.1.3', revision: '7b1ebf28ef'
2022-04-18T15:44:02.393+0000 [DEBUG] [TestEventLogger]         System info: host: 'vm-osx-xcode-13.3.x-g2.4core-2c292c9b-168e-4744-b89f-3e7756272483.local', ip: 'fe80:0:0:0:1807:af7c:e23f:7704%en0', os.name: 'Mac OS X', os.arch: 'x86_64', os.version: '12.2.1', java.version: '17.0.2'
2022-04-18T15:44:02.393+0000 [DEBUG] [TestEventLogger]         Driver info: driver.version: SelenideDriver
2022-04-18T15:44:02.393+0000 [DEBUG] [TestEventLogger]             at app//io.appium.java_client.remote.AppiumProtocolHandshake.createSession(AppiumProtocolHandshake.java:130)
2022-04-18T15:44:02.393+0000 [DEBUG] [TestEventLogger]             at app//io.appium.java_client.remote.AppiumProtocolHandshake.createSession(AppiumProtocolHandshake.java:102)
2022-04-18T15:44:02.393+0000 [DEBUG] [TestEventLogger]             at app//io.appium.java_client.remote.AppiumCommandExecutor.createSession(AppiumCommandExecutor.java:146)
2022-04-18T15:44:02.393+0000 [DEBUG] [TestEventLogger]             at app//io.appium.java_client.remote.AppiumCommandExecutor.execute(AppiumCommandExecutor.java:180)
2022-04-18T15:44:02.393+0000 [DEBUG] [TestEventLogger]             at app//org.openqa.selenium.remote.RemoteWebDriver.execute(RemoteWebDriver.java:567)
2022-04-18T15:44:02.393+0000 [DEBUG] [TestEventLogger]             ... 43 more
2022-04-18T15:44:02.394+0000 [DEBUG] [TestEventLogger] 
2022-04-18T15:44:02.394+0000 [DEBUG] [TestEventLogger]             Caused by:
2022-04-18T15:44:02.394+0000 [DEBUG] [TestEventLogger]             java.lang.reflect.InvocationTargetException
2022-04-18T15:44:02.394+0000 [DEBUG] [TestEventLogger]                 at java.base/jdk.internal.reflect.NativeMethodAccessorImpl.invoke0(Native Method)
2022-04-18T15:44:02.394+0000 [DEBUG] [TestEventLogger]                 at java.base/jdk.internal.reflect.NativeMethodAccessorImpl.invoke(NativeMethodAccessorImpl.java:77)
2022-04-18T15:44:02.394+0000 [DEBUG] [TestEventLogger]                 at java.base/jdk.internal.reflect.DelegatingMethodAccessorImpl.invoke(DelegatingMethodAccessorImpl.java:43)
2022-04-18T15:44:02.394+0000 [DEBUG] [TestEventLogger]                 at java.base/java.lang.reflect.Method.invoke(Method.java:568)
2022-04-18T15:44:02.394+0000 [DEBUG] [TestEventLogger]                 at io.appium.java_client.remote.AppiumProtocolHandshake.createSession(AppiumProtocolHandshake.java:126)
2022-04-18T15:44:02.394+0000 [DEBUG] [TestEventLogger]                 ... 47 more
2022-04-18T15:44:02.394+0000 [DEBUG] [TestEventLogger] 
2022-04-18T15:44:02.394+0000 [DEBUG] [TestEventLogger]                 Caused by:
2022-04-18T15:44:02.394+0000 [DEBUG] [TestEventLogger]                 org.openqa.selenium.TimeoutException: java.util.concurrent.TimeoutException
2022-04-18T15:44:02.394+0000 [DEBUG] [TestEventLogger]                 Build info: version: '4.1.3', revision: '7b1ebf28ef'
2022-04-18T15:44:02.394+0000 [DEBUG] [TestEventLogger]                 System info: host: 'vm-osx-xcode-13.3.x-g2.4core-2c292c9b-168e-4744-b89f-3e7756272483.local', ip: 'fe80:0:0:0:1807:af7c:e23f:7704%en0', os.name: 'Mac OS X', os.arch: 'x86_64', os.version: '12.2.1', java.version: '17.0.2'
2022-04-18T15:44:02.394+0000 [DEBUG] [TestEventLogger]                 Driver info: driver.version: SelenideDriver
2022-04-18T15:44:02.394+0000 [DEBUG] [TestEventLogger]                     at app//org.openqa.selenium.remote.http.netty.NettyHttpHandler.makeCall(NettyHttpHandler.java:72)
2022-04-18T15:44:02.394+0000 [DEBUG] [TestEventLogger]                     at app//org.openqa.selenium.remote.http.AddSeleniumUserAgent.lambda$apply$0(AddSeleniumUserAgent.java:42)
2022-04-18T15:44:02.394+0000 [DEBUG] [TestEventLogger]                     at app//io.appium.java_client.remote.AppiumCommandExecutor.lambda$createSession$0(AppiumCommandExecutor.java:149)
2022-04-18T15:44:02.394+0000 [DEBUG] [TestEventLogger]                     at app//org.openqa.selenium.remote.http.Filter.lambda$andFinally$1(Filter.java:56)
2022-04-18T15:44:02.394+0000 [DEBUG] [TestEventLogger]                     at app//org.openqa.selenium.remote.http.netty.NettyHttpHandler.execute(NettyHttpHandler.java:51)
2022-04-18T15:44:02.395+0000 [DEBUG] [TestEventLogger]                     at app//org.openqa.selenium.remote.http.AddSeleniumUserAgent.lambda$apply$0(AddSeleniumUserAgent.java:42)
2022-04-18T15:44:02.395+0000 [DEBUG] [TestEventLogger]                     at app//io.appium.java_client.remote.AppiumCommandExecutor.lambda$createSession$0(AppiumCommandExecutor.java:149)
2022-04-18T15:44:02.395+0000 [DEBUG] [TestEventLogger]                     at app//org.openqa.selenium.remote.http.Filter.lambda$andFinally$1(Filter.java:56)
2022-04-18T15:44:02.395+0000 [DEBUG] [TestEventLogger]                     at app//org.openqa.selenium.remote.http.netty.NettyClient.execute(NettyClient.java:124)
2022-04-18T15:44:02.395+0000 [DEBUG] [TestEventLogger]                     at app//org.openqa.selenium.remote.ProtocolHandshake.createSession(ProtocolHandshake.java:102)
2022-04-18T15:44:02.395+0000 [DEBUG] [TestEventLogger]                     ... 52 more
2022-04-18T15:44:02.395+0000 [DEBUG] [TestEventLogger] 
2022-04-18T15:44:02.395+0000 [DEBUG] [TestEventLogger]                     Caused by:
2022-04-18T15:44:02.395+0000 [DEBUG] [TestEventLogger]                     java.util.concurrent.TimeoutException
2022-04-18T15:44:02.395+0000 [DEBUG] [TestEventLogger]                         at java.base/java.util.concurrent.CompletableFuture.timedGet(CompletableFuture.java:1960)
2022-04-18T15:44:02.395+0000 [DEBUG] [TestEventLogger]                         at java.base/java.util.concurrent.CompletableFuture.get(CompletableFuture.java:2095)
2022-04-18T15:44:02.395+0000 [DEBUG] [TestEventLogger]                         at org.asynchttpclient.netty.NettyResponseFuture.get(NettyResponseFuture.java:206)
2022-04-18T15:44:02.395+0000 [DEBUG] [TestEventLogger]                         at org.openqa.selenium.remote.http.netty.NettyHttpHandler.makeCall(NettyHttpHandler.java:66)
2022-04-18T15:44:02.395+0000 [DEBUG] [TestEventLogger]                         ... 61 more
2022-04-18T15:44:02.397+0000 [DEBUG] [TestEventLogger] 
2022-04-18T15:44:02.397+0000 [DEBUG] [TestEventLogger] Books Around iOS Smoke > TestThreadFirst > com.tunein.mobile.tests.ios.IosBooksAroundFirstTest STARTED
2022-04-18T15:44:02.397+0000 [DEBUG] [TestEventLogger] 
2022-04-18T15:44:02.397+0000 [DEBUG] [TestEventLogger] Books Around iOS Smoke > TestThreadFirst > com.tunein.mobile.tests.ios.IosBooksAroundFirstTest > firstScreenTest STARTED
2022-04-18T15:44:02.397+0000 [DEBUG] [TestEventLogger] 
2022-04-18T15:44:02.397+0000 [DEBUG] [TestEventLogger] Books Around iOS Smoke > TestThreadFirst > com.tunein.mobile.tests.ios.IosBooksAroundFirstTest > firstScreenTest STANDARD_ERROR
2022-04-18T15:44:02.397+0000 [DEBUG] [TestEventLogger]     [TestNG-tests-1] INFO com.codeborne.selenide.logevents.SimpleReport - Report for firstScreenTest
2022-04-18T15:44:02.398+0000 [DEBUG] [TestEventLogger]     +----------------------+---------+------------+------------+
2022-04-18T15:44:02.398+0000 [DEBUG] [TestEventLogger]     | Element              | Subject | Status     | ms.        |
2022-04-18T15:44:02.398+0000 [DEBUG] [TestEventLogger]     +----------------------+---------+------------+------------+
2022-04-18T15:44:02.398+0000 [DEBUG] [TestEventLogger]     +----------------------+---------+------------+------------+
2022-04-18T15:44:02.398+0000 [DEBUG] [TestEventLogger] 
2022-04-18T15:44:02.398+0000 [DEBUG] [TestEventLogger] 
2022-04-18T15:44:02.398+0000 [DEBUG] [TestEventLogger] Books Around iOS Smoke > TestThreadFirst > com.tunein.mobile.tests.ios.IosBooksAroundFirstTest > firstScreenTest SKIPPED
2022-04-18T15:44:02.398+0000 [DEBUG] [TestEventLogger] 
2022-04-18T15:44:02.399+0000 [DEBUG] [TestEventLogger] Books Around iOS Smoke > TestThreadFirst > com.tunein.mobile.tests.ios.IosBooksAroundFirstTest PASSED
2022-04-18T15:44:02.399+0000 [DEBUG] [TestEventLogger] 
2022-04-18T15:44:02.399+0000 [DEBUG] [TestEventLogger] Books Around iOS Smoke > TestThreadFirst STANDARD_ERROR
2022-04-18T15:44:02.399+0000 [DEBUG] [TestEventLogger]     [TestNG-tests-1] INFO com.codeborne.selenide.impl.WebDriverThreadLocalContainer - No webdriver is bound to current thread: 17 - let's create a new webdriver
2022-04-18T15:44:02.417+0000 [DEBUG] [TestEventLogger] 
2022-04-18T15:44:02.417+0000 [DEBUG] [TestEventLogger] Books Around iOS Smoke > TestThreadFirst STANDARD_OUT
2022-04-18T15:44:02.417+0000 [DEBUG] [TestEventLogger]     [HTTP] <-- POST /wd/hub/session - - ms - -
2022-04-18T15:44:02.418+0000 [DEBUG] [TestEventLogger]     [HTTP] 
2022-04-18T15:44:02.418+0000 [DEBUG] [TestEventLogger]     [HTTP] Could not cache the response identified by '840fdd17-98b8-4b70-90d8-9f818f664d38', because it has not been completed
2022-04-18T15:44:02.419+0000 [DEBUG] [TestEventLogger]     [HTTP] Does the client terminate connections too early?
2022-04-18T15:44:02.576+0000 [DEBUG] [TestEventLogger]     [debug] [WD Proxy] Matched '/status' to command name 'getStatus'
2022-04-18T15:44:02.577+0000 [DEBUG] [TestEventLogger]     [debug] [WD Proxy] Proxying [GET /status] to [GET http://127.0.0.1:8237/status] with no body
2022-04-18T15:44:02.577+0000 [DEBUG] [TestEventLogger]     [WD Proxy] connect ECONNREFUSED 127.0.0.1:8237
2022-04-18T15:44:03.577+0000 [DEBUG] [TestEventLogger]     [debug] [WD Proxy] Matched '/status' to command name 'getStatus'
2022-04-18T15:44:03.577+0000 [DEBUG] [TestEventLogger]     [debug] [WD Proxy] Proxying [GET /status] to [GET http://127.0.0.1:8237/status] with no body
2022-04-18T15:44:03.578+0000 [DEBUG] [TestEventLogger]     [WD Proxy] connect ECONNREFUSED 127.0.0.1:8237
2022-04-18T15:44:04.582+0000 [DEBUG] [TestEventLogger]     [debug] [WD Proxy] Matched '/status' to command name 'getStatus'
2022-04-18T15:44:04.582+0000 [DEBUG] [TestEventLogger]     [debug] [WD Proxy] Proxying [GET /status] to [GET http://127.0.0.1:8237/status] with no body
2022-04-18T15:44:04.583+0000 [DEBUG] [TestEventLogger]     [WD Proxy] connect ECONNREFUSED 127.0.0.1:8237
2022-04-18T15:44:05.584+0000 [DEBUG] [TestEventLogger]     [debug] [WD Proxy] Matched '/status' to command name 'getStatus'
2022-04-18T15:44:05.584+0000 [DEBUG] [TestEventLogger]     [debug] [WD Proxy] Proxying [GET /status] to [GET http://127.0.0.1:8237/status] with no body
2022-04-18T15:44:05.585+0000 [DEBUG] [TestEventLogger]     [WD Proxy] connect ECONNREFUSED 127.0.0.1:8237
2022-04-18T15:44:06.587+0000 [DEBUG] [TestEventLogger]     [debug] [WD Proxy] Matched '/status' to command name 'getStatus'
2022-04-18T15:44:06.588+0000 [DEBUG] [TestEventLogger]     [debug] [WD Proxy] Proxying [GET /status] to [GET http://127.0.0.1:8237/status] with no body
2022-04-18T15:44:06.588+0000 [DEBUG] [TestEventLogger]     [WD Proxy] connect ECONNREFUSED 127.0.0.1:8237
2022-04-18T15:44:06.886+0000 [LIFECYCLE] [org.gradle.cache.internal.DefaultFileLockManager] 
2022-04-18T15:44:06.886+0000 [DEBUG] [org.gradle.cache.internal.DefaultFileLockManager] Waiting to acquire shared lock on daemon addresses registry.
2022-04-18T15:44:06.886+0000 [DEBUG] [org.gradle.cache.internal.DefaultFileLockManager] Lock acquired on daemon addresses registry.
2022-04-18T15:44:06.886+0000 [DEBUG] [org.gradle.cache.internal.DefaultFileLockManager] Releasing lock on daemon addresses registry.
2022-04-18T15:44:06.887+0000 [DEBUG] [org.gradle.cache.internal.DefaultFileLockManager] Waiting to acquire shared lock on daemon addresses registry.
2022-04-18T15:44:06.887+0000 [DEBUG] [org.gradle.cache.internal.DefaultFileLockManager] Lock acquired on daemon addresses registry.
2022-04-18T15:44:06.887+0000 [DEBUG] [org.gradle.cache.internal.DefaultFileLockManager] Releasing lock on daemon addresses registry.
2022-04-18T15:44:06.637+0000 [LIFECYCLE] [class org.gradle.internal.buildevents.TaskExecutionLogger] 
2022-04-18T15:44:06.637+0000 [LIFECYCLE] [class org.gradle.internal.buildevents.TaskExecutionLogger] > Task :runTest
2022-04-18T15:44:07.360+0000 [DEBUG] [TestEventLogger] 
2022-04-18T15:44:07.360+0000 [DEBUG] [TestEventLogger] Books Around iOS Smoke > TestThreadFirst STANDARD_ERROR
2022-04-18T15:44:07.360+0000 [DEBUG] [TestEventLogger]     [TestNG-tests-1] INFO com.codeborne.selenide.impl.FileHelper - Creating folder: /Users/vagrant/git/build/downloads/1650296642356_2354_17
2022-04-18T15:44:07.434+0000 [DEBUG] [TestEventLogger] 
2022-04-18T15:44:07.434+0000 [DEBUG] [TestEventLogger] Books Around iOS Smoke > TestThreadFirst STANDARD_OUT
2022-04-18T15:44:07.434+0000 [DEBUG] [TestEventLogger]     [debug] [HTTP] Request idempotency key: 51fabfe9-d168-4553-af25-7c3c66b9679b
2022-04-18T15:44:07.436+0000 [DEBUG] [TestEventLogger]     [HTTP] --> POST /wd/hub/session
2022-04-18T15:44:07.437+0000 [DEBUG] [TestEventLogger]     [HTTP] {"capabilities":{"firstMatch":[{}],"alwaysMatch":{"appium:app":"https://firebasestorage.googleapis.com/v0/b/books-around-2fbb6.appspot.com/o/Books_Around.app.zip?alt=media&token=5405d060-e234-410f-93c6-a6edea395ff4","appium:automationName":"XCuiTest","appium:bundleId":"com.woodwayfarer.swift.BooksAround","appium:derivedDataPath":"/Users/vagrant/git/deriveData/8D9886F0-A093-4ABC-A81A-54909F9DD9A3","appium:deviceName":"IOS_DEVICE_NAME","appium:enablePerformanceLogging":true,"appium:language":"en","appium:locale":"en_US","appium:locationServicesAuthorized":true,"appium:newCommandTimeout":180,"appium:permissions":"{\"com.woodwayfarer.swift.BooksAround\":{\"userTracking\":\"NO\",\"location\":\"always\",\"notifications\":\"NO\"}}","appium:platformVersion":"15.4","appium:processArguments":{"args":["-UIAutomation","-upsellScreen.showOnLaunch","false","-upsellScreen.donePlusFlow","false","-regwall.module.enabled","true","-caterpillar.regwall.enabled","false","-abtest.ids","0","-player.autoRestartPlayerDefault","fal...
2022-04-18T15:44:07.437+0000 [DEBUG] [TestEventLogger]     [debug] [W3C] Calling AppiumDriver.createSession() with args: [null,null,{"firstMatch":[{}],"alwaysMatch":{"appium:app":"https://firebasestorage.googleapis.com/v0/b/books-around-2fbb6.appspot.com/o/Books_Around.app.zip?alt=media&token=5405d060-e234-410f-93c6-a6edea395ff4","appium:automationName":"XCuiTest","appium:bundleId":"com.woodwayfarer.swift.BooksAround","appium:derivedDataPath":"/Users/vagrant/git/deriveData/8D9886F0-A093-4ABC-A81A-54909F9DD9A3","appium:deviceName":"IOS_DEVICE_NAME","appium:enablePerformanceLogging":true,"appium:language":"en","appium:locale":"en_US","appium:locationServicesAuthorized":true,"appium:newCommandTimeout":180,"appium:permissions":"{\"com.woodwayfarer.swift.BooksAround\":{\"userTracking\":\"NO\",\"location\":\"always\",\"notifications\":\"NO\"}}","appium:platformVersion":"15.4","appium:processArguments":{"args":["-UIAutomation","-upsellScreen.showOnLaunch","false","-upsellScreen.donePlusFlow","false","-regwall.module.enabled","true","-caterpillar.regwall.enabled","false","-abtest.ids","0","-player.autoRestartPlayerDefault","false","...
2022-04-18T15:44:07.437+0000 [DEBUG] [TestEventLogger]     [debug] [BaseDriver] Event 'newSessionRequested' logged at 1650296647438 (15:44:07 GMT+0000 (Greenwich Mean Time))
2022-04-18T15:44:07.438+0000 [DEBUG] [TestEventLogger]     [Appium] Appium v1.22.3 creating new XCUITestDriver (v3.59.0) session
2022-04-18T15:44:07.439+0000 [DEBUG] [TestEventLogger]     [Appium] Applying relaxed security to 'XCUITestDriver' as per server command line argument. All insecure features will be enabled unless explicitly disabled by --deny-insecure
2022-04-18T15:44:07.439+0000 [DEBUG] [TestEventLogger]     [Appium] Explicitly enabling use of insecure features:
2022-04-18T15:44:07.439+0000 [DEBUG] [TestEventLogger]     [Appium]     true
2022-04-18T15:44:07.441+0000 [DEBUG] [TestEventLogger]     [debug] [BaseDriver] Creating session with W3C capabilities: {
2022-04-18T15:44:07.441+0000 [DEBUG] [TestEventLogger]     [debug] [BaseDriver]   "alwaysMatch": {
2022-04-18T15:44:07.441+0000 [DEBUG] [TestEventLogger]     [debug] [BaseDriver]     "platformName": "ios",
2022-04-18T15:44:07.441+0000 [DEBUG] [TestEventLogger]     [debug] [BaseDriver]     "appium:app": "https://firebasestorage.googleapis.com/v0/b/books-around-2fbb6.appspot.com/o/Books_Around.app.zip?alt=media&token=5405d060-e234-410f-93c6-a6edea395ff4",
2022-04-18T15:44:07.441+0000 [DEBUG] [TestEventLogger]     [debug] [BaseDriver]     "appium:automationName": "XCuiTest",
2022-04-18T15:44:07.442+0000 [DEBUG] [TestEventLogger]     [debug] [BaseDriver]     "appium:bundleId": "com.woodwayfarer.swift.BooksAround",
2022-04-18T15:44:07.442+0000 [DEBUG] [TestEventLogger]     [debug] [BaseDriver]     "appium:derivedDataPath": "/Users/vagrant/git/deriveData/8D9886F0-A093-4ABC-A81A-54909F9DD9A3",
2022-04-18T15:44:07.442+0000 [DEBUG] [TestEventLogger]     [debug] [BaseDriver]     "appium:deviceName": "IOS_DEVICE_NAME",
2022-04-18T15:44:07.442+0000 [DEBUG] [TestEventLogger]     [debug] [BaseDriver]     "appium:enablePerformanceLogging": true,
2022-04-18T15:44:07.442+0000 [DEBUG] [TestEventLogger]     [debug] [BaseDriver]     "appium:language": "en",
2022-04-18T15:44:07.442+0000 [DEBUG] [TestEventLogger]     [debug] [BaseDriver]     "appium:locale": "en_US",
2022-04-18T15:44:07.443+0000 [DEBUG] [TestEventLogger]     [debug] [BaseDriver]     "appium:locationServicesAuthorized": true,
2022-04-18T15:44:07.443+0000 [DEBUG] [TestEventLogger]     [debug] [BaseDriver]     "appium:newCommandTimeout": 180,
2022-04-18T15:44:07.443+0000 [DEBUG] [TestEventLogger]     [debug] [BaseDriver]     "appium:permissions": "{\"com.woodwayfarer.swift.BooksAround\":{\"userTracking\":\"NO\",\"location\":\"always\",\"notifications\":\"NO\"}}",
2022-04-18T15:44:07.443+0000 [DEBUG] [TestEventLogger]     [debug] [BaseDriver]     "appium:platformVersion": "15.4",
2022-04-18T15:44:07.443+0000 [DEBUG] [TestEventLogger]     [debug] [BaseDriver]     "appium:processArguments": {
2022-04-18T15:44:07.443+0000 [DEBUG] [TestEventLogger]     [debug] [BaseDriver]       "args": [
2022-04-18T15:44:07.443+0000 [DEBUG] [TestEventLogger]     [debug] [BaseDriver]         "-UIAutomation",
2022-04-18T15:44:07.443+0000 [DEBUG] [TestEventLogger]     [debug] [BaseDriver]         "-upsellScreen.showOnLaunch",
2022-04-18T15:44:07.443+0000 [DEBUG] [TestEventLogger]     [debug] [BaseDriver]         "false",
2022-04-18T15:44:07.444+0000 [DEBUG] [TestEventLogger]     [debug] [BaseDriver]         "-upsellScreen.donePlusFlow",
2022-04-18T15:44:07.444+0000 [DEBUG] [TestEventLogger]     [debug] [BaseDriver]         "false",
2022-04-18T15:44:07.444+0000 [DEBUG] [TestEventLogger]     [debug] [BaseDriver]         "-regwall.module.enabled",
2022-04-18T15:44:07.444+0000 [DEBUG] [TestEventLogger]     [debug] [BaseDriver]         "true",
2022-04-18T15:44:07.444+0000 [DEBUG] [TestEventLogger]     [debug] [BaseDriver]         "-caterpillar.regwall.enabled",
2022-04-18T15:44:07.444+0000 [DEBUG] [TestEventLogger]     [debug] [BaseDriver]         "false",
2022-04-18T15:44:07.445+0000 [DEBUG] [TestEventLogger]     [debug] [BaseDriver]         "-abtest.ids",
2022-04-18T15:44:07.445+0000 [DEBUG] [TestEventLogger]     [debug] [BaseDriver]         "0",
2022-04-18T15:44:07.445+0000 [DEBUG] [TestEventLogger]     [debug] [BaseDriver]         "-player.autoRestartPlayerDefault",
2022-04-18T15:44:07.445+0000 [DEBUG] [TestEventLogger]     [debug] [BaseDriver]         "false",
2022-04-18T15:44:07.445+0000 [DEBUG] [TestEventLogger]     [debug] [BaseDriver]         "-nowplaying.chrysalisPlayerButtons.enabled",
2022-04-18T15:44:07.445+0000 [DEBUG] [TestEventLogger]     [debug] [BaseDriver]         "false",
2022-04-18T15:44:07.445+0000 [DEBUG] [TestEventLogger]     [debug] [BaseDriver]         "-ratings.prompt.enabled",
2022-04-18T15:44:07.445+0000 [DEBUG] [TestEventLogger]     [debug] [BaseDriver]         "false",
2022-04-18T15:44:07.446+0000 [DEBUG] [TestEventLogger]     [debug] [BaseDriver]         "-fm.search.prePopulate",
2022-04-18T15:44:07.446+0000 [DEBUG] [TestEventLogger]     [debug] [BaseDriver]         "",
2022-04-18T15:44:07.446+0000 [DEBUG] [TestEventLogger]     [debug] [BaseDriver]         "-subscription.periodic.restorePurchases",
2022-04-18T15:44:07.446+0000 [DEBUG] [TestEventLogger]     [debug] [BaseDriver]         "false",
2022-04-18T15:44:07.446+0000 [DEBUG] [TestEventLogger]     [debug] [BaseDriver]         "-premium.tab.tooltip.enabled",
2022-04-18T15:44:07.446+0000 [DEBUG] [TestEventLogger]     [debug] [BaseDriver]         "false",
2022-04-18T15:44:07.446+0000 [DEBUG] [TestEventLogger]     [debug] [BaseDriver]         "-ads.gdpr.consent.form.enabled",
2022-04-18T15:44:07.446+0000 [DEBUG] [TestEventLogger]     [debug] [BaseDriver]         "false",
2022-04-18T15:44:07.446+0000 [DEBUG] [TestEventLogger]     [debug] [BaseDriver]         "-ads.welcome.enabled",
2022-04-18T15:44:07.446+0000 [DEBUG] [TestEventLogger]     [debug] [BaseDriver]         "false",
2022-04-18T15:44:07.446+0000 [DEBUG] [TestEventLogger]     [debug] [BaseDriver]         "-bannerads.enabled",
2022-04-18T15:44:07.446+0000 [DEBUG] [TestEventLogger]     [debug] [BaseDriver]         "false"
2022-04-18T15:44:07.447+0000 [DEBUG] [TestEventLogger]     [debug] [BaseDriver]       ]
2022-04-18T15:44:07.447+0000 [DEBUG] [TestEventLogger]     [debug] [BaseDriver]     },
2022-04-18T15:44:07.447+0000 [DEBUG] [TestEventLogger]     [debug] [BaseDriver]     "appium:showXcodeLog": false,
2022-04-18T15:44:07.447+0000 [DEBUG] [TestEventLogger]     [debug] [BaseDriver]     "appium:udid": "8D9886F0-A093-4ABC-A81A-54909F9DD9A3",
2022-04-18T15:44:07.447+0000 [DEBUG] [TestEventLogger]     [debug] [BaseDriver]     "appium:wdaLocalPort": 8237
2022-04-18T15:44:07.447+0000 [DEBUG] [TestEventLogger]     [debug] [BaseDriver]   },
2022-04-18T15:44:07.447+0000 [DEBUG] [TestEventLogger]     [debug] [BaseDriver]   "firstMatch": [
2022-04-18T15:44:07.447+0000 [DEBUG] [TestEventLogger]     [debug] [BaseDriver]     {}
2022-04-18T15:44:07.447+0000 [DEBUG] [TestEventLogger]     [debug] [BaseDriver]   ]
2022-04-18T15:44:07.447+0000 [DEBUG] [TestEventLogger]     [debug] [BaseDriver] }