# Ionic-archive - Erro Android - Build-tool 32.0.0 is missing DX

**URL:** <https://discuss.bitrise.io/t/ionic-archive-erro-android-build-tool-32-0-0-is-missing-dx/20638>\
**Category:** Builds\
**Tags:** ionic, android\
**Created:** [July 27, 2022, 4:43pm UTC](https://discuss.bitrise.io/t/ionic-archive-erro-android-build-tool-32-0-0-is-missing-dx/20638 "2022-07-27T16:43:03Z")\
**Posts on this page:** 4\
**Page:** 1

<div class="post-metadata">

**Author:** ![adshan](https://avatars.discourse-cdn.com/v4/letter/a/e95f7d/32.png) [@adshan](https://discuss.bitrise.io/u/adshan)\
**Post date:** [July 27, 2022, 4:43pm UTC](https://discuss.bitrise.io/t/ionic-archive-erro-android-build-tool-32-0-0-is-missing-dx/20638/1 "2022-07-27T16:43:03Z")

</div>

## Description of the issue

On Jul 13 we had a SUCCESS in our build, but now, with the same branch and same workflow we had FAILED with a message “Installed Build Tools revision 32.0.0 is corrupted. Remove and install again using the SDK Manager.”

## Environment:

SUCCESS  
Agent version: 1.36.1  
bitrise “run” version: 1.49.0

FAILED  
Agent version: 1.38.0  
bitrise “run” version: 1.49.3

## Erro

> Build-tool 32.0.0 is missing DX at /usr/local/share/android-sdk/build-tools/32.0.0/dx  
> FAILURE: Build failed with an exception.
> 
> - What went wrong:  
> Could not determine the dependencies of task ‘:app:compileReleaseJavaWithJavac’.  
> Installed Build Tools revision 32.0.0 is corrupted. Remove and install again using the SDK Manager.

---

<div class="post-metadata">

**Author:** ![adshan](https://avatars.discourse-cdn.com/v4/letter/a/e95f7d/32.png) [@adshan](https://discuss.bitrise.io/u/adshan)\
**Post date:** [July 29, 2022, 10:27am UTC](https://discuss.bitrise.io/t/ionic-archive-erro-android-build-tool-32-0-0-is-missing-dx/20638/2 "2022-07-29T10:27:40Z")

</div>

The solution was to run this before my failed step.

> cd /usr/local/share/android-sdk/build-tools/32.0.0 \ && mv d8 dx \ && cd lib \ && mv d8.jar dx.jar

---

<div class="post-metadata">

**Author:** ![SimonWatt](https://avatars.discourse-cdn.com/v4/letter/s/d78d45/32.png) [@SimonWatt](https://discuss.bitrise.io/u/SimonWatt)\
**Post date:** [August 2, 2022, 8:32pm UTC](https://discuss.bitrise.io/t/ionic-archive-erro-android-build-tool-32-0-0-is-missing-dx/20638/3 "2022-08-02T20:32:52Z")

</div>

I had the same issue. Above command with script step before Cordova Archive step did the trick.

---

<div class="post-metadata">

**Author:** ![system](https://us1.discourse-cdn.com/flex016/uploads/bitrise/original/2X/d/d901cf2aad020f2dd11918afc89ec2089bb87b35.png) [@system](https://discuss.bitrise.io/u/system)\
**Post date:** [September 1, 2022, 8:33pm UTC](https://discuss.bitrise.io/t/ionic-archive-erro-android-build-tool-32-0-0-is-missing-dx/20638/4 "2022-09-01T20:33:16Z")

</div>

This topic was automatically closed 30 days after the last reply. New replies are no longer allowed.
