# Question & Answer

**URL:** https://discuss.bitrise.io/c/question-answer/7.md?page=1

[Latest](https://discuss.bitrise.io/latest.md) · [Categories](https://discuss.bitrise.io/categories.md) · [Tags](https://discuss.bitrise.io/tags.md)

**Page:** 2

---

## [Subject: Persistent iOS Build Failure: darwin-podhelper.rb Circular Dependency on Standard Flutter Build](https://discuss.bitrise.io/t/subject-persistent-ios-build-failure-darwin-podhelper-rb-circular-dependency-on-standard-flutter-build/25259)

<div class="topic-metadata">

**Author:** [@PowerFinderGlobal](https://discuss.bitrise.io/u/PowerFinderGlobal)\
**Replies:** 1\
**Last updated:** [June 4, 2025, 9:00am UTC](https://discuss.bitrise.io/t/subject-persistent-ios-build-failure-darwin-podhelper-rb-circular-dependency-on-standard-flutter-build/25259 "2025-06-04T09:00:11Z")

</div>

Description of the issue Hello Bitrise Support Team, I’m consistently encountering a build failure on my Flutter iOS project with a very specific error, and it appears to be a circular dependency related to darwin-podhe…

---

## [Xcode Build for Simulator Succeeds But Build Is Just Black Screen](https://discuss.bitrise.io/t/xcode-build-for-simulator-succeeds-but-build-is-just-black-screen/25271)

<div class="topic-metadata">

**Author:** [@glennposadas2023](https://discuss.bitrise.io/u/glennposadas2023)\
**Replies:** 0\
**Last updated:** [June 3, 2025, 8:27pm UTC](https://discuss.bitrise.io/t/xcode-build-for-simulator-succeeds-but-build-is-just-black-screen/25271 "2025-06-03T20:27:33Z")

</div>

Everything is perfectly fine (e.g Firebase distribution, Archiving, AppStoreConnect distribution, and whatnot). I have to add an extra step Xcode Build for Simulator to extract the .app artifact for maestro. It succeed…

---

## ["Test Reports wasn't configured correctly." with Junit XML file](https://discuss.bitrise.io/t/test-reports-wasnt-configured-correctly-with-junit-xml-file/25266)

<div class="topic-metadata">

**Author:** [@calebr](https://discuss.bitrise.io/u/calebr)\
**Replies:** 0\
**Last updated:** [June 3, 2025, 2:50pm UTC](https://discuss.bitrise.io/t/test-reports-wasnt-configured-correctly-with-junit-xml-file/25266 "2025-06-03T14:50:49Z")

</div>

I have been trying to get the Export test results to Test Reports add-on to work and haven’t had much success. I installed junit-xml to get the proper file type into my repository. The file is created in my expected loca…

---

## [WhiteListing Build IP's](https://discuss.bitrise.io/t/whitelisting-build-ips/25195)

<div class="topic-metadata">

**Author:** [@venkat.aluri](https://discuss.bitrise.io/u/venkat.aluri)\
**Replies:** 0\
**Last updated:** [May 7, 2025, 1:36am UTC](https://discuss.bitrise.io/t/whitelisting-build-ips/25195 "2025-05-07T01:36:45Z")

</div>

Hi, I am trying to run automation tests on bitrise. The build fails as one of the endpoints is getting restricted on bitrise. My companies network team requested for Build Ip’s to whitelist them. Is it possible if I co…

---

## [Android Emulator - None of the images \<API34 are working](https://discuss.bitrise.io/t/android-emulator-none-of-the-images-api34-are-working/24122)

<div class="topic-metadata">

**Author:** [@sdfgsdfgd](https://discuss.bitrise.io/u/sdfgsdfgd)\
**Replies:** 3\
**Last updated:** [May 5, 2025, 7:57pm UTC](https://discuss.bitrise.io/t/android-emulator-none-of-the-images-api34-are-working/24122 "2025-05-05T19:57:09Z")

</div>

So on ubuntu-22 the latest container, which Android API versions and which image types are supported and is working ? so far anything I tried between API 24 to 30 don’t work. 31 doesn’t work. 32 doesn’t work. None of…

---

## [Failed to Trigger the Build: cannot unmarshal number into Go struct field](https://discuss.bitrise.io/t/failed-to-trigger-the-build-cannot-unmarshal-number-into-go-struct-field/25177)

<div class="topic-metadata">

**Author:** [@dspoeri](https://discuss.bitrise.io/u/dspoeri)\
**Replies:** 2\
**Last updated:** [April 25, 2025, 12:52pm UTC](https://discuss.bitrise.io/t/failed-to-trigger-the-build-cannot-unmarshal-number-into-go-struct-field/25177 "2025-04-25T12:52:42Z")

</div>

Hi, we are unable to start a Bitrise build for new pull requests from GitHub. Redelivering or new PR =\> same error Error 400: {“errors”:\[“Failed to Trigger Build: Failed to Trigger the Build: TriggerBuild (url:http:/…

---

## [Commit message trigger firing on commit\_messages](https://discuss.bitrise.io/t/commit-message-trigger-firing-on-commit-messages/25170)

<div class="topic-metadata">

**Author:** [@jamesw](https://discuss.bitrise.io/u/jamesw)\
**Replies:** 0\
**Last updated:** [April 23, 2025, 6:41am UTC](https://discuss.bitrise.io/t/commit-message-trigger-firing-on-commit-messages/25170 "2025-04-23T06:41:00Z")

</div>

I have just had a build triggered that I don’t think should have run when a commit was pushed to a GitHub PR. I’ve checked that there are no triggers for the specific workflow in Bitrise. There is a project-based legacy…

---

## [How to get the trigger type from within a build](https://discuss.bitrise.io/t/how-to-get-the-trigger-type-from-within-a-build/25145)

<div class="topic-metadata">

**Author:** [@bwidulski-mdsol](https://discuss.bitrise.io/u/bwidulski-mdsol)\
**Replies:** 0\
**Last updated:** [April 11, 2025, 5:27pm UTC](https://discuss.bitrise.io/t/how-to-get-the-trigger-type-from-within-a-build/25145 "2025-04-11T17:27:22Z")

</div>

Hey guys, I’m attempting to create a Bitrise/slack integration where my team’s builds are sent in a specific slack channel after running. The slack part is working properly and I’m able to send messages with their relev…

---

## [\[CodeSigning\] Can't upload iOS signing certificates: I get a 400 error from POST https://app.bitrise.io/build\_certificate/preview](https://discuss.bitrise.io/t/codesigning-cant-upload-ios-signing-certificates-i-get-a-400-error-from-post-https-app-bitrise-io-build-certificate-preview/25042)

<div class="topic-metadata">

**Author:** [@miriam.hayes](https://discuss.bitrise.io/u/miriam.hayes)\
**Replies:** 3\
**Last updated:** [April 9, 2025, 11:06pm UTC](https://discuss.bitrise.io/t/codesigning-cant-upload-ios-signing-certificates-i-get-a-400-error-from-post-https-app-bitrise-io-build-certificate-preview/25042 "2025-04-09T23:06:21Z")

</div>

I’m exporting p12 signing certificates from my local keychain and when I try to ‘Continue’ after adding the file, nothing happens and I see the 400 API error in the Chrome console. { "error\_msg": "Getting details of…

---

## [React Native - ios extensions](https://discuss.bitrise.io/t/react-native-ios-extensions/25113)

<div class="topic-metadata">

**Author:** [@Nehal\_Sanklecha](https://discuss.bitrise.io/u/Nehal_Sanklecha)\
**Replies:** 1\
**Last updated:** [April 8, 2025, 3:37am UTC](https://discuss.bitrise.io/t/react-native-ios-extensions/25113 "2025-04-08T03:37:14Z")

</div>

Bitrise Build Issue Report template From app store, I’m getting warning mails regarding ITMS-90473. CFBundlerVersion and CFBundleShortVersionString mismatch Description of the issue update-ios-version: steps: …

---

## [Fetching a swift package using .netrc](https://discuss.bitrise.io/t/fetching-a-swift-package-using-netrc/25097)

<div class="topic-metadata">

**Author:** [@LukeRobertsUZ](https://discuss.bitrise.io/u/LukeRobertsUZ)\
**Replies:** 0\
**Last updated:** [April 2, 2025, 10:55am UTC](https://discuss.bitrise.io/t/fetching-a-swift-package-using-netrc/25097 "2025-04-02T10:55:12Z")

</div>

I have a Swift Package that fetches a binary target from a URL. This requires credentials in the .netrc file and all works fine locally. In Bitrise, I have used the ‘Authenticate host with netrc’ step before any of my b…

---

## [Bitrise-step-install-bundle fails to load](https://discuss.bitrise.io/t/bitrise-step-install-bundle-fails-to-load/25088)

<div class="topic-metadata">

**Author:** [@jgcorporation](https://discuss.bitrise.io/u/jgcorporation)\
**Replies:** 2\
**Last updated:** [April 2, 2025, 12:49am UTC](https://discuss.bitrise.io/t/bitrise-step-install-bundle-fails-to-load/25088 "2025-04-02T00:49:09Z")

</div>

The build was working fine until yesterday, but today we are experiencing build errors. When I checked the contents, it seems that the following step failed to load. Could you please confirm this?

---

## [Xcode build command not applied](https://discuss.bitrise.io/t/xcode-build-command-not-applied/25060)

<div class="topic-metadata">

**Author:** [@heather.haylett](https://discuss.bitrise.io/u/heather.haylett)\
**Replies:** 0\
**Last updated:** [March 21, 2025, 8:05pm UTC](https://discuss.bitrise.io/t/xcode-build-command-not-applied/25060 "2025-03-21T20:05:49Z")

</div>

Bitrise Build Issue Report template Description of the issue I’ve set an additional option for the xcodebuild command but it’s only applied to the first instance xcodebuild is run Environment: Xcode 16.2 based on macOS …

---

## [ARCHIVE FAILED PhaseScriptExecution Bundle\\ React\\ Native\\ code\\ and\\ images](https://discuss.bitrise.io/t/archive-failed-phasescriptexecution-bundle-react-native-code-and-images/25047)

<div class="topic-metadata">

**Author:** [@nkornasevich](https://discuss.bitrise.io/u/nkornasevich)\
**Replies:** 0\
**Last updated:** [March 19, 2025, 8:25pm UTC](https://discuss.bitrise.io/t/archive-failed-phasescriptexecution-bundle-react-native-code-and-images/25047 "2025-03-19T20:25:20Z")

</div>

Bitrise Build Issue Report template PhaseScriptExecution Bundle\\ React\\ Native\\ code\\ and\\ images /Users/vagrant/git/mobile/ios/DerivedData/Build/Intermediates.noindex/ArchiveIntermediates/piastrix/IntermediateBuildFiles…

---

## [Merge build, fatal: ambiguous argument 'HEAD^': unknown revision or path not in the working tree](https://discuss.bitrise.io/t/merge-build-fatal-ambiguous-argument-head-unknown-revision-or-path-not-in-the-working-tree/24907)

<div class="topic-metadata">

**Author:** [@timea.varga](https://discuss.bitrise.io/u/timea.varga)\
**Replies:** 1\
**Last updated:** [March 14, 2025, 7:17pm UTC](https://discuss.bitrise.io/t/merge-build-fatal-ambiguous-argument-head-unknown-revision-or-path-not-in-the-working-tree/24907 "2025-03-14T19:17:38Z")

</div>

We are building pipeline with parallel workflow execution of unit tests. A script step is added to check for changed files in the specific modules. The script is working for pull request builds on Bitrise, but for merge …

---

## [Bitrise Doashboard error status 500](https://discuss.bitrise.io/t/bitrise-doashboard-error-status-500/25020)

<div class="topic-metadata">

**Author:** [@tai\_pham\_dh](https://discuss.bitrise.io/u/tai_pham_dh)\
**Replies:** 2\
**Last updated:** [March 13, 2025, 10:19am UTC](https://discuss.bitrise.io/t/bitrise-doashboard-error-status-500/25020 "2025-03-13T10:19:21Z")

</div>

When I log in to Bitrise, it redirects me to the dashboard. But I can not access it, and it shows page 500. I try to use another laptop or browser but non of it working

---

## [Cannot authenticate with Apple ID connection](https://discuss.bitrise.io/t/cannot-authenticate-with-apple-id-connection/25012)

<div class="topic-metadata">

**Author:** [@jgcorporation](https://discuss.bitrise.io/u/jgcorporation)\
**Replies:** 1\
**Last updated:** [March 11, 2025, 4:14am UTC](https://discuss.bitrise.io/t/cannot-authenticate-with-apple-id-connection/25012 "2025-03-11T04:14:18Z")

</div>

I have seen a similar issue in a previous thread, but now I am getting an error with Apple ID Connection. I have my AppleAccount set up for SMS authentication, but I am unable to authenticate from Bitrise. === This ph…

---

## [GH Status report is missung with Pipeline triggered with bitrise API](https://discuss.bitrise.io/t/gh-status-report-is-missung-with-pipeline-triggered-with-bitrise-api/25008)

<div class="topic-metadata">

**Author:** [@piotr-pulsetto](https://discuss.bitrise.io/u/piotr-pulsetto)\
**Replies:** 0\
**Last updated:** [March 7, 2025, 1:19pm UTC](https://discuss.bitrise.io/t/gh-status-report-is-missung-with-pipeline-triggered-with-bitrise-api/25008 "2025-03-07T13:19:07Z")

</div>

Bitrise Build Issue Report template Description of the issue I am triggering pipeline using api, passing only branch name. Params sent to Bitrise api { “build\_params”: { “triggered\_by”: “”, “branch”: “”, “pipeline\_…

---

## [Upgrading xcode stack to 16.2 fails](https://discuss.bitrise.io/t/upgrading-xcode-stack-to-16-2-fails/24999)

<div class="topic-metadata">

**Author:** [@alexlives](https://discuss.bitrise.io/u/alexlives)\
**Replies:** 1\
**Last updated:** [March 6, 2025, 11:20pm UTC](https://discuss.bitrise.io/t/upgrading-xcode-stack-to-16-2-fails/24999 "2025-03-06T23:20:47Z")

</div>

Bitrise Build Issue Report template Description of the issue Upgrading the stack from xcode 15.4 to 16.2 causes the Export to Archive step to fail. The core issue is that the log is stating I’m using Legacy Build System.…

---

## [Xcode 16.2 performance issues while running tests](https://discuss.bitrise.io/t/xcode-16-2-performance-issues-while-running-tests/24776)

<div class="topic-metadata">

**Author:** [@marialuiza.fornagier](https://discuss.bitrise.io/u/marialuiza.fornagier)\
**Replies:** 1\
**Last updated:** [March 6, 2025, 7:50pm UTC](https://discuss.bitrise.io/t/xcode-16-2-performance-issues-while-running-tests/24776 "2025-03-06T19:50:37Z")

</div>

Hi. I’m in the process of trying to update our workflows from xcode 15.4 to xcode 16.2 and i noticed that some tests take as long as twice as much to run in xcode 16.2. Is anyone else experiencing the same?

---

## [Xcode build fails with "Build fails Packages are not supported when using legacy build locations..."](https://discuss.bitrise.io/t/xcode-build-fails-with-build-fails-packages-are-not-supported-when-using-legacy-build-locations/24662)

<div class="topic-metadata">

**Author:** [@ghenady](https://discuss.bitrise.io/u/ghenady)\
**Replies:** 1\
**Last updated:** [March 6, 2025, 6:26pm UTC](https://discuss.bitrise.io/t/xcode-build-fails-with-build-fails-packages-are-not-supported-when-using-legacy-build-locations/24662 "2025-03-06T18:26:29Z")

</div>

After adding Swift Macro I’m getting an error in command: xcodebuild “-project” “…xcodeproj” “-target” “…” “-configuration” “Release” “-showBuildSettings” ailed to execute Step main logic: … Resolve Package Graph Pa…

---

## [Fastlane Match Decryption Failed - Invalid MATCH\_PASSWORD Error on Bitrise](https://discuss.bitrise.io/t/fastlane-match-decryption-failed-invalid-match-password-error-on-bitrise/24979)

<div class="topic-metadata">

**Author:** [@prasad.rawas](https://discuss.bitrise.io/u/prasad.rawas)\
**Replies:** 0\
**Last updated:** [February 26, 2025, 6:03am UTC](https://discuss.bitrise.io/t/fastlane-match-decryption-failed-invalid-match-password-error-on-bitrise/24979 "2025-02-26T06:03:24Z")

</div>

I am experiencing an issue with Fastlane Match on Bitrise while trying to retrieve provisioning profiles. The build fails with the following error: \[04:38:57\]: wrong final block length \[04:38:57\]: Couldn’t decrypt the …

---

## [Only run step if if changed files contains tests](https://discuss.bitrise.io/t/only-run-step-if-if-changed-files-contains-tests/24956)

<div class="topic-metadata">

**Author:** [@steveaura](https://discuss.bitrise.io/u/steveaura)\
**Replies:** 0\
**Last updated:** [February 14, 2025, 8:22pm UTC](https://discuss.bitrise.io/t/only-run-step-if-if-changed-files-contains-tests/24956 "2025-02-14T20:22:08Z")

</div>

Hey everyone, We run test coverage steps in our workflow that post the coverage as a comment back to the PR. That works well but becomes noisy if there are multiple pushes after the PR was opened. Is it possible to mak…

---

## [Unit Tests with Mockk always fails on CI but works on locally](https://discuss.bitrise.io/t/unit-tests-with-mockk-always-fails-on-ci-but-works-on-locally/24943)

<div class="topic-metadata">

**Author:** [@sevbanBayir](https://discuss.bitrise.io/u/sevbanBayir)\
**Replies:** 1\
**Last updated:** [February 13, 2025, 11:54am UTC](https://discuss.bitrise.io/t/unit-tests-with-mockk-always-fails-on-ci-but-works-on-locally/24943 "2025-02-13T11:54:13Z")

</div>

Hi I have some unit tests for my multi-modular Android Project and I want to run a CI pipeline with these tests but as the header says some tests that are using mockk to mocking operations are failing on CI server (using…

---

## [AssetDataSourceException: java.io.FileNotFoundException: splash\_video.mp4](https://discuss.bitrise.io/t/assetdatasourceexception-java-io-filenotfoundexception-splash-video-mp4/24933)

<div class="topic-metadata">

**Author:** [@javier.gonzalez](https://discuss.bitrise.io/u/javier.gonzalez)\
**Replies:** 1\
**Last updated:** [February 10, 2025, 3:04pm UTC](https://discuss.bitrise.io/t/assetdatasourceexception-java-io-filenotfoundexception-splash-video-mp4/24933 "2025-02-10T15:04:59Z")

</div>

Bitrise Build Issue Report template Description of the issue I have a splash video in my android buid. When I run the app from my android studio the exoplayer get the video from asset. But when I create the build with b…

---

## [Type hint for inputs in step.yml](https://discuss.bitrise.io/t/type-hint-for-inputs-in-step-yml/24890)

<div class="topic-metadata">

**Author:** [@jonathanj](https://discuss.bitrise.io/u/jonathanj)\
**Replies:** 0\
**Last updated:** [January 29, 2025, 7:55am UTC](https://discuss.bitrise.io/t/type-hint-for-inputs-in-step-yml/24890 "2025-01-29T07:55:47Z")

</div>

I have an input that is an ID for a third party integration. That ID is typically 19 characters long, and usually all digits, when the UI is used to capture this input, the value in the YAML is treated as a number and be…

---

## [Is there a way to see the .xcresult file in the Artifacts tab for actual device testing?](https://discuss.bitrise.io/t/is-there-a-way-to-see-the-xcresult-file-in-the-artifacts-tab-for-actual-device-testing/24879)

<div class="topic-metadata">

**Author:** [@smitr0556](https://discuss.bitrise.io/u/smitr0556)\
**Replies:** 0\
**Last updated:** [January 28, 2025, 1:34am UTC](https://discuss.bitrise.io/t/is-there-a-way-to-see-the-xcresult-file-in-the-artifacts-tab-for-actual-device-testing/24879 "2025-01-28T01:34:21Z")

</div>

HI, I am trying to see the xcresult file under the Artifacts tab for device testing, but I can only see the xcresult file under the Artifacts tab for simulator testing.

---

## [Bitrise \`save-spm-cache\` step takes a lot of time](https://discuss.bitrise.io/t/bitrise-save-spm-cache-step-takes-a-lot-of-time/24767)

<div class="topic-metadata">

**Author:** [@ahmdmhasn](https://discuss.bitrise.io/u/ahmdmhasn)\
**Replies:** 1\
**Last updated:** [January 21, 2025, 6:13pm UTC](https://discuss.bitrise.io/t/bitrise-save-spm-cache-step-takes-a-lot-of-time/24767 "2025-01-21T18:13:32Z")

</div>

We’re migrating to the new cache system and I noticed a very high save cache time (44m) compared to (2m) on the legacy system. Input: - verbose: true - derived\_data\_path: ~/Library/Developer/Xcode/DerivedData/\*\* - proje…

---

## [beforeAll() timesout when running e2e on bitrise (not happening on local)](https://discuss.bitrise.io/t/beforeall-timesout-when-running-e2e-on-bitrise-not-happening-on-local/24848)

<div class="topic-metadata">

**Author:** [@rodrigocastrounblur](https://discuss.bitrise.io/u/rodrigocastrounblur)\
**Replies:** 0\
**Last updated:** [January 20, 2025, 3:05pm UTC](https://discuss.bitrise.io/t/beforeall-timesout-when-running-e2e-on-bitrise-not-happening-on-local/24848 "2025-01-20T15:05:30Z")

</div>

My e2e tests are running normally on my local environment, but they’re failing when running with bitrise. It is failing when trying to execute beforeAll(): ● ARA › Create ARA but not be able to save because empty fiel…

---

## [How to set the baseline metrics in UI tests and compare the results with the metrics values in bitrise](https://discuss.bitrise.io/t/how-to-set-the-baseline-metrics-in-ui-tests-and-compare-the-results-with-the-metrics-values-in-bitrise/24842)

<div class="topic-metadata">

**Author:** [@smitr0556](https://discuss.bitrise.io/u/smitr0556)\
**Replies:** 0\
**Last updated:** [January 17, 2025, 8:53pm UTC](https://discuss.bitrise.io/t/how-to-set-the-baseline-metrics-in-ui-tests-and-compare-the-results-with-the-metrics-values-in-bitrise/24842 "2025-01-17T20:53:09Z")

</div>

How to set baseline metrics in Bitrise, compare them with average values, and obtain results based on the comparison. Is there an option in Bitrise to perform this operation?

[Previous page](https://discuss.bitrise.io/c/question-answer/7.md)

[Next page](https://discuss.bitrise.io/c/question-answer/7.md?page=2)
